{"text_format":"1","workbook":"xlsx","n_sheets":2,"sheets":["Material","Lookup"],"not_rendered":{"charts":0,"images":1,"macros":1,"external_links":1,"defined_names":11,"comments":1,"pivot_tables":0},"unopened":[],"bounds":{"document_bytes":16777216,"sheet_cells":100000,"rows_first":2000,"rows_last":500,"rows_between":2000,"halvings":0,"cell_chars":16384,"cell_head_chars":4096},"cells_cut":0,"cells_raw":0,"read":"whole","date_system":"1900"}

{"sheet":"Material","index":0,"n_rows":123,"n_cols":28,"rows_kept":123,"cut":false,"hidden":false,"merged":[[19,20,19,22],[21,8,21,10],[21,16,21,22],[3,4,3,27],[15,3,15,7],[19,3,19,7],[9,3,9,7],[8,3,8,7],[18,3,18,7],[10,3,10,7],[11,3,11,7],[12,3,12,7],[13,3,13,7],[14,3,14,7],[7,20,7,22]]}
[]
[null,null,"Template version:","v1.6 - 18/05/2018"]
[]
[null,null,null,null,"E-PACKING SLIP"]
[]
[]
[null,null,"Grey headed columns to be completed by Vendor",null,null,null,null,null,null,null,null,null,null,null,null,null,null,null,null,{"$f":"IF(U8=\"\",\"Please select a delivery address here\",\"\")","v":"Please select a delivery address here"}]
[null,null,null,null,null,null,null,null,null,null,null,null,null,null,null,null,null,null,null,"Delivery Address:"]
[null,null,"Company Name:",null,null,null,null,null,null,null,null,null,null,null,null,null,null,null,null,"To:"]
[null,null,"Vendor address:",null,null,null,null,null,null,null,null,null,null,null,null,null,null,null,null,null,{"$f":"IF(Material!$U$8=\"Peterson HUB\",Lookup!$AA$2,IF(Material!$U$8=\"DHR Heliport\",Lookup!$AA$3,\"Please select a delivery address\"))","v":"Please select a delivery address"}]
[null,null,"Postall Code / City:",null,null,null,null,null,null,null,null,null,null,null,null,null,null,null,null,"Delivery address:",{"$f":"IF(Material!$U$8=\"Peterson HUB\",Lookup!$AB$2,IF(Material!$U$8=\"DHR Heliport\",Lookup!$AB$3,\"\"))","v":""}]
[null,null,"Country:",null,null,null,null,null,null,null,null,null,null,null,null,null,null,null,null,null,{"$f":"IF(Material!$U$8=\"Peterson HUB\",Lookup!$AC$2,IF(Material!$U$8=\"DHR Heliport\",Lookup!$AC$3,\"\"))","v":""}]
[]
[null,null,"Vendor contact: (name / email)"]
[null,null,"Vendor contact: (telephone / fax)",null,null,null,null,null,null,null,null,null,null,null,null,null,null,null,null,"Telephone No:",{"$f":"IF(Material!$U$8=\"Peterson HUB\",Lookup!$AD$2,IF(Material!$U$8=\"DHR Heliport\",Lookup!$AD$3,\"\"))","v":""}]
[null,null,"Customs No:"]
[null,null,null,null,null,null,null,null,null,null,null,null,null,null,null,null,null,null,null,"Email:",{"$f":"IF(Material!$U$8=\"Peterson HUB\",Lookup!$AE$2,IF(Material!$U$8=\"DHR Heliport\",Lookup!$AE$3,\"\"))","v":""}]
[]
[null,null,"Date of booking request:",null,null,null,null,null,null,null,null,null,null,null,null,null,null,null,null,{"$f":"IF(U20=\"\",\"Please select a destination location here\",\"\")","v":"Please select a destination location here"}]
[null,null,"Delivery date:",null,null,null,null,null,null,null,null,null,null,null,null,null,null,null,null,"Destination location:"]
[]
[null,null,null,null,null,null,null,null,"Only for Helifreight",null,null,null,null,null,null,null,"Only if applicable"]
[null,"Item No.","PO number","PO item","Material description","Material number","Qty","Weight (kg)","Length (cm)","Width (cm)","Height (cm)","UOM","Packaging type","Material value (EUR)","Country of Origin (ISO2 code)","Commodity Code (10-digit)","D.G. UN No.","D.G. Class","D.G. Subsidiary risk","D.G. Proper Shipping Name","D.G. Marine Pollutant","D.G. Ltd Qty","D.G. Packing Group","Customs Status","Customs Document number","Customs Document date","Unique vendor identification number","Other references"]
[null,1]
[null,2]
[null,3]
[null,4]
[null,5]
[null,6]
[null,7]
[null,8]
[null,9]
[null,10]
[null,11]
[null,12]
[null,13]
[null,14]
[null,15]
[null,16]
[null,17]
[null,18]
[null,19]
[null,20]
[null,21]
[null,22]
[null,23]
[null,24]
[null,25]
[null,26]
[null,27]
[null,28]
[null,29]
[null,30]
[null,31]
[null,32]
[null,33]
[null,34]
[null,35]
[null,36]
[null,37]
[null,38]
[null,39]
[null,40]
[null,41]
[null,42]
[null,43]
[null,44]
[null,45]
[null,46]
[null,47]
[null,48]
[null,49]
[null,50]
[null,51]
[null,52]
[null,53]
[null,54]
[null,55]
[null,56]
[null,57]
[null,58]
[null,59]
[null,60]
[null,61]
[null,62]
[null,63]
[null,64]
[null,65]
[null,66]
[null,67]
[null,68]
[null,69]
[null,70]
[null,71]
[null,72]
[null,73]
[null,74]
[null,75]
[null,76]
[null,77]
[null,78]
[null,79]
[null,80]
[null,81]
[null,82]
[null,83]
[null,84]
[null,85]
[null,86]
[null,87]
[null,88]
[null,89]
[null,90]
[null,91]
[null,92]
[null,93]
[null,94]
[null,95]
[null,96]
[null,97]
{"$rows_left_out":4}
{"sheet":"Lookup","index":1,"n_rows":246,"n_cols":37,"rows_kept":246,"cut":false,"hidden":true,"merged":[]}
["CONT ABBR","COMPANY","country","comment",null,"Class nr.","Text",null," Location Name","shipping point","ship-to party","sales org",null,"Packaging material","Code",null,"Vendor","Code",null,"Ctr","Name",null,"UoM","UoM Name",null,"Delivery Adress","Street","City","Country","Phone","Email",null,null,null,"Change on","Change by","Change"]
["Aberdeen Container Company","ACC","UK",null,null,1,"EXPLO",null,"Den Helder","NL02",830008,"NL01",null,"ASP container",4000000000,null,"BAKER HUGHES (NEDERLAND) BV","Baker Hughes",null,"AD","Andorra",null,"EA","each",null,"Peterson HUB","Industrieweg 31 - 35","1785 AG Den Helder","The Netherlands","+31(0)223 685 349","nam-admin-hub@shell.com",null,null,null,"2018-05-17","Brenda","Added W2W locations: Kasteelborg, Leman C (W2W), Leman D (W2W), Lemand F (W2W, Leman G (W2W)"]
["Aggreko","AGGR","UK",null,null,2,"GASES",null,"AMELAND-1","NL02",832002,"NL01",null,"Bag",4000000000,null,"BRAND ENERGY SERVICES BV","Brand Energy",null,"AE","Utd.Arab.Emir.",null,"M","Meter",null,"DHR Heliport","Luchthavenweg 10F","1786 PP Den Helder","The Netherlands","+31(0)223 685 349","NAM-helifreightdenhelder@shell.com",null,null,null,null,null,"Removed obsolete locations: Remstar, Noble Al White, Swift, Atlantic Rotterdam, Kraken"]
["Air Products","AIRP","UK",null,null,3,"FLAML",null,"AMELAND-2","NL02","832003","NL01",null,"Bagage / luggage",4000000000,null,"BUS HANDELSMAATSCHAPPIJ BV","BUS Handelmy",null,"AF","Afghanistan",null,"M3","Cubic meter",null,null,null,null,null,null,null,null,null,null,"2018-05-18","Brenda","Added 50 line items to sheet 'Material', ref. issue Pon Power"]
["Anadrill","ANAD","UK",null,null,4,"FLAMS",null,"AWG-1 OFFSHORE","NL02","832004","NL01",null,"Battery box",4000000000,null,"CENTRAL MUDPLANT AND FLUID SERVICES","CMF",null,"AG","Antigua/Barbads",null,"TNE","Tonne (Metric)"]
["Airpac Bukom Services","APAC","UK",null,null,5,"OXIDZ",null,"K14-FA-1P","NL02","832016","NL01",null,"Bigbag",4000000000,null,"Den Helder Stores","Den Helder Stores",null,"AI","Anguilla",null,"BAG","Bag"]
["ASEP UK Ltd","ASEP ","UK",null,null,6,"CORRO",null,"K14-FB-1","NL02","832017","NL01",null,"Box",4000000000,null,"HARSCO INFRASTRUCTURE","Harsco",null,"AL","Albania",null,"KG","Kilogram"]
["ATI Tanks Great Yarmouth","ATI","UK",null,null,7,"RADIO",null,"K14-FA-1C","NL02","832018","NL01",null,"Bundle",4000000000,null,"KWS","KWS",null,"AM","Armenia",null,"L","Liter"]
["ATR Plant Services","ATR ","UK",null,null,8,"TOXIC",null,"K15-FA-1","NL02","832019","NL01",null,"Coil",4000000000,null,"LINDE GAS BENELUX BV","Linde Gas",null,"AN","Dutch Antilles",null,"BO","Bottle"]
["Atlas Wireline Services","AWS","UK",null,null,9,"MISCE",null,"K15-FB-1","NL02","832020","NL01",null,"Container",4000000000,null,"MI SWACO","MI SWACO",null,"AO","Angola",null,"BX","Box"]
["Baker Hughes Inteq","BHI","UK",null,null,null,null,null,"K15-FC-1","NL02","832021","NL01",null,"Crate wood",4000000000,null,"NAM WELLSERVICE","NAM Wellservice",null,"AQ","Antarctica",null,"CAN","Canister"]
["BJ Serviceas","BJS","UK",null,null,null,null,null,"K15-FG-1","NL02","832022","NL01",null,"Cylinder",4000000000,null,"ODFJELL WELL SERVICES NETHERLANDS","ODFJELL",null,"AR","Argentina",null,"CAS","Case"]
["BJ Tubular Services","BJST","UK",null,null,null,null,null,"K15-FK-1","NL02","832023","NL01",null,"Drum",4000000000,null,"OPTIMA","OPTIMA",null,"AS","Samoa,American",null,"COL","coil"]
["Baker Oil Tools","BKRO","UK",null,null,null,null,null,"K7-FA-1","NL02","832024","NL01",null,"Eco-Box",4000000000,null,"OSS","OSS",null,"AT","Austria",null,"CR","Crate"]
["Bluewater","BLUE","UK",null,null,null,null,null,"K7-FD-1","NL02","832025","NL01",null,"Frame",4000000000,null,"PETERSON CHEMICALS BV","PETERSON CHEMICALS",null,"AU","Australia",null,"CT","Carton"]
["BOC","BOC","UK",null,null,null,null,null,"K7-FB-1","NL02","832026","NL01",null,"Gas bottle",4000000000,null,"PETERSON IJMUIDEN","Peterson IJm",null,"AW","Aruba",null,"DR","Drum"]
["BUS Handelsmij","BUS","NL",null,null,null,null,null,"K8-FA-1 PP","NL02","832027","NL01",null,"IBC",4000000000,null,"REYM B.V.","Reym",null,"AZ","Azerbaijan",null,"JR","Jar"]
["Caird Environmental","CAIR","UK",null,null,null,null,null,"K8-FA-2","NL02","832028","NL01",null,"Jerrican",4000000000,null,"SCHLUMBERGER OFFSHORE SERVICES LTD","Schlumberger",null,"BA","Bosnia-Herz.",null,"JT","Joint"]
["Camerons","CAM","UK",null,null,null,null,null,"K8-FA-3","NL02","832029","NL01",null,"Kit",4000000000,null,"SPARROWS OFFSHORE SERVICES LTD","Sparrows",null,"BB","Barbados",null,"PAI","Pail"]
["Castrol","CAST","UK",null,null,null,null,null,"K8-FA-1 AP","NL02","832030","NL01",null,"Lot",4000000000,null,"SPERRY-SUN DRILLING SERVICES","SPERRY",null,"BD","Bangladesh",null,"PAL","Pallet"]
["Container Company Aberdeen","CCA","UK","probably the same as ACC",null,null,null,null,"L13-FC-1","NL02","832031","NL01",null,"Packed",4000000000,null,"VENKO OFFSHORE BV","VENKO",null,"BE","Belgium",null,"PK","Package"]
["Coates Offshore","COAT","UK",null,null,null,null,null,"L13-FD-1","NL02","832032","NL01",null,"Pallet",4000000000,null,"TUBOSCOPE VETCO (DEUTSCHLAND) GMBH","VETCO",null,"BF","Burkina-Faso",null,"RL","Reel"]
["Continental Containers","COL","UK",null,null,null,null,null,"L13-FE-1","NL02","832033","NL01",null,"Piece",4000000000,null,"VAN GANSEWINKEL NEDERLAND B.V.","VGW",null,"BG","Bulgaria",null,"SA","sack"]
["Conserve","CSER","UK",null,null,null,null,null,"L2-FA-1","NL02","832036","NL01",null,"Rack",4000000000,null,null,null,null,"BH","Bharain",null,"SET","Set"]
["Dominion Gas","DGAS","UK",null,null,null,null,null,"L9-FF-1","NL02","832038","NL01",null,"Reel",4000000000,null,null,null,null,"BI","Burundi",null,"SP","Spool"]
["Dowell Schulmberger","DOW","UK",null,null,null,null,null,"K17","NL02","832052","NL01",null,"Unpackaged",4000000000,null,null,null,null,"BJ","Benin"]
["Drilquip","DRIL","UK",null,null,null,null,null,"L9-FA-1","NL02","832059","NL01",null,"Wheely bin",4000000000,null,null,null,null,"BM","Bermuda"]
["Swire","EPD","UK / NL",null,null,null,null,null,"L9-FB-1","NL02","832060","NL01",null,null,null,null,null,null,null,"BN","Brunei"]
["Expro","EXPR","UK",null,null,null,null,null,"Seafox-4","NL02","832061","NL01",null,null,null,null,null,null,null,"BO","Bolivia"]
["Franks International","FCC","UK",null,null,null,null,null,"Ensco 122","NL02","832089","NL01",null,null,null,null,null,null,null,"BR","Brazil"]
["Ferguson Seacabs","FSC","UK",null,null,null,null,null,"Kasteelborg","NL02","832791","NL01",null,null,null,null,null,null,null,"BS","Bahamas"]
["Van Gansewinkel","GNW","NL",null,null,null,null,null,"Kroonborg","NL02","832091","NL01",null,null,null,null,null,null,null,"BT","Bhutan"]
["Grampian Test Certificate","GTCL","UK",null,null,null,null,null,"CutterQC (W2W)","NL02","831308","GB01",null,null,null,null,null,null,null,"BV","Bouvet Islands"]
["Halliburton","HAL","UK",null,null,null,null,null,"CarrackQA (W2W)","NL02","831309","GB01",null,null,null,null,null,null,null,"BW","Botswana"]
["Halliburton Montrose","HALM","UK",null,null,null,null,null,"BrigantineBG (W2W)","NL02","831310","GB01",null,null,null,null,null,null,null,"BY","White Russia"]
["Halliburton Portlethen","HALP","UK",null,null,null,null,null,"BrigantineBR (W2W)","NL02","831311","GB01",null,null,null,null,null,null,null,"BZ","Belize"]
["Harsco infrastructure","HAR","NL",null,null,null,null,null,"SP BarquePB (W2W)","NL02","831312","GB01",null,null,null,null,null,null,null,"CA","Canada"]
["Harran","HARN","UK",null,null,null,null,null,"SP GalleonPG (W2W)","NL02","831313","GB01",null,null,null,null,null,null,null,"CC","Coconut Islands"]
["NAM wellservice","HGZ","NL",null,null,null,null,null,"SP BarquePL (W2W)","NL02","831314","GB01",null,null,null,null,null,null,null,"CF","Central Afr.Rep"]
["KVA Limited","KVAL","UK",null,null,null,null,null,"SP GalleonPN (W2W)","NL02","831315","GB01",null,null,null,null,null,null,null,"CG","Congo"]
["Kvaerner","KVER","UK",null,null,null,null,null,"SP Skiff (W2W)","NL02","831316","GB01",null,null,null,null,null,null,null,"CH","Switzerland"]
["Labtech","LAB OR LTEC","UK",null,null,null,null,null,"Shamrock (W2W)","NL02","831317","GB01",null,null,null,null,null,null,null,"CI","Ivory Coast"]
["Maersk Contractors","MCON","UK",null,null,null,null,null,"Caravel (W2W)","NL02","831318","GB01",null,null,null,null,null,null,null,"CK","Cook Islands"]
["Muehlhan S-Prot Ltd","MSPL","UK",null,null,null,null,null,"Leman B (W2W)","NL02","831325","GB01",null,null,null,null,null,null,null,"CL","Chile"]
["North Offshore","NORO","UK",null,null,null,null,null,"Leman C (W2W)","NL02","831326","GB01",null,null,null,null,null,null,null,"CM","Cameroon"]
["North Sea Compactors","NSC ","UK",null,null,null,null,null,"Leman D (W2W)","NL02","831327","GB01",null,null,null,null,null,null,null,"CN","China"]
["Offshore Equipment Group","OEG","UK",null,null,null,null,null,"Leman F (W2W)","NL02","831328","GB01",null,null,null,null,null,null,null,"CO","Colombia"]
["CMF/Oyster","OYS","NL",null,null,null,null,null,"Leman G (W2W)","NL02","831329","GB01",null,null,null,null,null,null,null,"CR","Costa Rica"]
["Premier Oilfield Svs","POOS ","UK",null,null,null,null,null,null,null,null,null,null,null,null,null,null,null,null,"CU","Cuba"]
["Qserve","QSER","UK",null,null,null,null,null,"AOB",null,830001,"GB02",null,null,null,null,null,null,null,"CV","Cape Verde"]
["Reym B.V.","REY","NL",null,null,null,null,null,"ANASURIA",null,831001,"GB02",null,null,null,null,null,null,null,"CW","Curaçao"]
["Rigblast","RGBL","UK",null,null,null,null,null,"MAERSK CURLEW",null,831003,"GB02",null,null,null,null,null,null,null,"CX","Christmas Islnd"]
["Roemex","ROE","UK",null,null,null,null,null,"GANNET ALPHA",null,831007,"GB02",null,null,null,null,null,null,null,"CY","Cyprus"]
["Salamis","SALM","UK",null,null,null,null,null,"SHEARWATER",null,831010,"GB02",null,null,null,null,null,null,null,"CZ","Czech Republic"]
["Schlumberger","SCHL","UK",null,null,null,null,null,"SEDCO 711",null,831028,"GB02",null,null,null,null,null,null,null,"DE","Germany"]
["Seawell","SEAD","UK",null,null,null,null,null,"OCEAN GUARDIAN",null,831021,"GB02",null,null,null,null,null,null,null,"DJ","Djibouti"]
["Shell ","SH","UK",null,null,null,null,null,"BRENT ALPHA",null,831122,"GB02",null,null,null,null,null,null,null,"DK","Denmark"]
["Siemens","SIEM","UK",null,null,null,null,null,"BRENT BRAVO",null,831123,"GB02",null,null,null,null,null,null,null,"DM","Dominica"]
["Succes Oil- and Gasfield Services","SOG","NL",null,null,null,null,null,"BRENT CHARLIE",null,831124,"GB02",null,null,null,null,null,null,null,"DO","Dominican Rep."]
["Sparrows","SPA","UK",null,null,null,null,null,"BRENT DELTA",null,831125,"GB02",null,null,null,null,null,null,null,"DZ","Algeria"]
["SPS","SPS","UK",null,null,null,null,null,"GOLDENEYE",null,831126,"GB02",null,null,null,null,null,null,null,"EC","Ecuador"]
["Sabre Safety Ltd","SSL","UK",null,null,null,null,null,"NELSON",null,831450,"GB02",null,null,null,null,null,null,null,"EE","Estonia"]
["Stats UK","STAT","UK",null,null,null,null,null,"HANS DEUL",null,831455,"GB02",null,null,null,null,null,null,null,"EG","Egypt"]
["Stork","STRK","UK",null,null,null,null,null,"SKANDI CONSTRUCTOR",null,831457,"GB02",null,null,null,null,null,null,null,"EH","Western Sahara"]
["Sub Sea","SUBS","UK",null,null,null,null,null,"ISLAND ENFORCER",null,831458,"GB02",null,null,null,null,null,null,null,"ER","Eritrea"]
["Shell UK Oil","SUKO","UK",null,null,null,null,null,"REGALIA",null,831073,"GB02",null,null,null,null,null,null,null,"ES","Spain"]
["Sureclean","SURE","UK",null,null,null,null,null,"HAEWENE BRIM",null,831251,"GB02",null,null,null,null,null,null,null,"ET","Ethiopia"]
["Schlumberger Wireline","SWT ","UK",null,null,null,null,null,"DRAUGEN","NO01",810129,"NO02",null,null,null,null,null,null,null,"FI","Finland"]
["Transmit","TRMT","UK",null,null,null,null,null,"TRANSOCEAN BARENTS","NO01",830164,"NO33",null,null,null,null,null,null,null,"FJ","Fiji"]
["Total Waste Management","TWM","UK",null,null,null,null,null,"WEST NAVIGATOR","NO01",830162,"NO02",null,null,null,null,null,null,null,"FK","Falkland Isles"]
["Unit Equipment Services AG","UES","NL",null,null,null,null,null,null,null,null,null,null,null,null,null,null,null,null,"FM","Micronesia"]
["Venko B.V.","VEN","NL",null,null,null,null,null,null,null,null,null,null,null,null,null,null,null,null,"FO","Faeroe"]
["Vetco","VTCO","UK",null,null,null,null,null,null,null,null,null,null,null,null,null,null,null,null,"FR","France"]
["Weatherford","WETH","UK",null,null,null,null,null,null,null,null,null,null,null,null,null,null,null,null,"GA","Gabon"]
["Weatherford Offrentals","WETO","UK",null,null,null,null,null,null,null,null,null,null,null,null,null,null,null,null,"GB","United Kingdom"]
[null,null,null,null,null,null,null,null,null,null,null,null,null,null,null,null,null,null,null,"GD","Grenada"]
[null,null,null,null,null,null,null,null,null,null,null,null,null,null,null,null,null,null,null,"GE","Georgia"]
[null,null,null,null,null,null,null,null,null,null,null,null,null,null,null,null,null,null,null,"GF","French Guinea"]
[null,null,null,null,null,null,null,null,null,null,null,null,null,null,null,null,null,null,null,"GG","Guernsey"]
[null,null,null,null,null,null,null,null,null,null,null,null,null,null,null,null,null,null,null,"GH","Ghana"]
[null,null,null,null,null,null,null,null,null,null,null,null,null,null,null,null,null,null,null,"GI","Gibraltar"]
[null,null,null,null,null,null,null,null,null,null,null,null,null,null,null,null,null,null,null,"GL","Greenland"]
[null,null,null,null,null,null,null,null,null,null,null,null,null,null,null,null,null,null,null,"GM","Gambia"]
[null,null,null,null,null,null,null,null,null,null,null,null,null,null,null,null,null,null,null,"GN","Guinea"]
[null,null,null,null,null,null,null,null,null,null,null,null,null,null,null,null,null,null,null,"GP","Guadeloupe"]
[null,null,null,null,null,null,null,null,null,null,null,null,null,null,null,null,null,null,null,"GQ","Equatorial Guin"]
[null,null,null,null,null,null,null,null,null,null,null,null,null,null,null,null,null,null,null,"GR","Greece"]
[null,null,null,null,null,null,null,null,null,null,null,null,null,null,null,null,null,null,null,"GS","S. Sandwich Ins"]
[null,null,null,null,null,null,null,null,null,null,null,null,null,null,null,null,null,null,null,"GT","Guatemala"]
[null,null,null,null,null,null,null,null,null,null,null,null,null,null,null,null,null,null,null,"GU","Guam"]
[null,null,null,null,null,null,null,null,null,null,null,null,null,null,null,null,null,null,null,"GW","Guinea-Bissau"]
[null,null,null,null,null,null,null,null,null,null,null,null,null,null,null,null,null,null,null,"GY","Guyana"]
[null,null,null,null,null,null,null,null,null,null,null,null,null,null,null,null,null,null,null,"HK","Hong Kong"]
[null,null,null,null,null,null,null,null,null,null,null,null,null,null,null,null,null,null,null,"HM","Heard/McDon.Isl"]
[null,null,null,null,null,null,null,null,null,null,null,null,null,null,null,null,null,null,null,"HN","Honduras"]
[null,null,null,null,null,null,null,null,null,null,null,null,null,null,null,null,null,null,null,"HR","Croatia"]
[null,null,null,null,null,null,null,null,null,null,null,null,null,null,null,null,null,null,null,"HT","Haiti"]
[null,null,null,null,null,null,null,null,null,null,null,null,null,null,null,null,null,null,null,"HU","Hungary"]
[null,null,null,null,null,null,null,null,null,null,null,null,null,null,null,null,null,null,null,"ID","Indonesia"]
[null,null,null,null,null,null,null,null,null,null,null,null,null,null,null,null,null,null,null,"IE","Ireland"]
[null,null,null,null,null,null,null,null,null,null,null,null,null,null,null,null,null,null,null,"IL","Israel"]
[null,null,null,null,null,null,null,null,null,null,null,null,null,null,null,null,null,null,null,"IM","Isle of Man"]
[null,null,null,null,null,null,null,null,null,null,null,null,null,null,null,null,null,null,null,"IN","India"]
[null,null,null,null,null,null,null,null,null,null,null,null,null,null,null,null,null,null,null,"IO","Brit.Ind.Oc.Ter"]
[null,null,null,null,null,null,null,null,null,null,null,null,null,null,null,null,null,null,null,"IQ","Iraq"]
[null,null,null,null,null,null,null,null,null,null,null,null,null,null,null,null,null,null,null,"IR","Iran"]
[null,null,null,null,null,null,null,null,null,null,null,null,null,null,null,null,null,null,null,"IS","Iceland"]
[null,null,null,null,null,null,null,null,null,null,null,null,null,null,null,null,null,null,null,"IT","Italy"]
[null,null,null,null,null,null,null,null,null,null,null,null,null,null,null,null,null,null,null,"JE","Jersey"]
[null,null,null,null,null,null,null,null,null,null,null,null,null,null,null,null,null,null,null,"JM","Jamaica"]
[null,null,null,null,null,null,null,null,null,null,null,null,null,null,null,null,null,null,null,"JO","Jordan"]
[null,null,null,null,null,null,null,null,null,null,null,null,null,null,null,null,null,null,null,"JP","Japan"]
[null,null,null,null,null,null,null,null,null,null,null,null,null,null,null,null,null,null,null,"KE","Kenya"]
[null,null,null,null,null,null,null,null,null,null,null,null,null,null,null,null,null,null,null,"KG","Kirghistan"]
[null,null,null,null,null,null,null,null,null,null,null,null,null,null,null,null,null,null,null,"KH","Cambodia"]
[null,null,null,null,null,null,null,null,null,null,null,null,null,null,null,null,null,null,null,"KI","Kiribati"]
[null,null,null,null,null,null,null,null,null,null,null,null,null,null,null,null,null,null,null,"KM","Comoro"]
[null,null,null,null,null,null,null,null,null,null,null,null,null,null,null,null,null,null,null,"KN","St Kitts&Nevis"]
[null,null,null,null,null,null,null,null,null,null,null,null,null,null,null,null,null,null,null,"KP","North Korea"]
[null,null,null,null,null,null,null,null,null,null,null,null,null,null,null,null,null,null,null,"KR","South Korea"]
{"$rows_left_out":126}